Skip to content
Started by timer
Running as SYSTEM
[EnvInject] - Loading node environment variables.
[EnvInject] - Preparing an environment for the build.
[EnvInject] - Keeping Jenkins system variables.
[EnvInject] - Keeping Jenkins build variables.
[EnvInject] - Injecting as environment variables the properties content 
KEYSTORE=/home/jenkins/javakey/respect-google-play.properties
RESPECT_DEFAULT_APPLIST=https://respect.world/respect-ds/manifestlist_ab9012e.json

[EnvInject] - Variables injected successfully.
[EnvInject] - Injecting contributions.
Building in workspace /home/jenkins/.jenkins/workspace/dev-language
The recommended git tool is: NONE
No credentials specified
 > git rev-parse --resolve-git-dir /home/jenkins/.jenkins/workspace/dev-language/.git # timeout=10
Fetching changes from the remote Git repository
 > git config remote.origin.url https://github.com/UstadMobile/Respect.git # timeout=10
Fetching upstream changes from https://github.com/UstadMobile/Respect.git
 > git --version # timeout=10
 > git --version # 'git version 2.43.0'
 > git fetch --tags --force --progress -- https://github.com/UstadMobile/Respect.git +refs/heads/*:refs/remotes/origin/* # timeout=10
 > git rev-parse refs/remotes/origin/dev-language^{commit} # timeout=10
Checking out Revision 8603806fa5162dce1f25e94ae2548a10dae00c69 (refs/remotes/origin/dev-language)
 > git config core.sparsecheckout # timeout=10
 > git checkout -f 8603806fa5162dce1f25e94ae2548a10dae00c69 # timeout=10
Commit message: "Merge remote-tracking branch 'origin/dev-language' into dev-language"
 > git rev-list --no-walk eec2d2fd1731941de1fecca59b4197f79435e1df # timeout=10
[Gradle] - Launching build.
[dev-language] $ /home/jenkins/.jenkins/workspace/dev-language/gradlew clean build respect-app-compose:bundle
Starting a Gradle Daemon (subsequent builds will be faster)
Type-safe project accessors is an incubating feature.

> Configure project :app-android
Keystore exists: true

> Configure project :lib-dataloadstate
WARNING: The 'commonTest' source directory exists, but android host tests are not enabled. To enable android host tests, add `withHostTest {}` to your android target configuration in the Gradle build file.
Add android.sync.suppressAgpWarnings=GENERIC to the gradle.properties file to suppress this warning.

> Configure project :lib-shared
WARNING: The 'commonTest' source directory exists, but android host tests are not enabled. To enable android host tests, add `withHostTest {}` to your android target configuration in the Gradle build file.
Add android.sync.suppressAgpWarnings=GENERIC to the gradle.properties file to suppress this warning.

[Incubating] Problems report is available at: file:///home/jenkins/.jenkins/workspace/dev-language/build/reports/problems/problems-report.html

FAILURE: Build failed with an exception.

* What went wrong:
Selection failed
  Cannot locate tasks that match 'respect-app-compose:bundle' as project 'respect-app-compose' not found in root project 'Respect'.

* Try:
> Run gradlew projects to get a list of available projects.
> For more on name expansion, please refer to https://docs.gradle.org/9.6.1/userguide/command_line_interface.html#sec:name_abbreviation in the Gradle documentation.
> Run with --stacktrace option to get the stack trace.
> Run with --info or --debug option to get more log output.
> Run with --scan to get full insights from a Build Scan (powered by Develocity).
> Get more help at https://help.gradle.org.

Deprecated Gradle features were used in this build, making it incompatible with Gradle 10.

You can use '--warning-mode all' to show the individual deprecation warnings and determine if they come from your own scripts or plugins.

For more on this, please refer to https://docs.gradle.org/9.6.1/userguide/command_line_interface.html#sec:command_line_warnings in the Gradle documentation.

BUILD FAILED in 10s
Build step 'Invoke Gradle script' changed build result to FAILURE
Build step 'Invoke Gradle script' marked build as failure
Archiving artifacts
[htmlpublisher] Archiving HTML reports...
[htmlpublisher] Archiving at PROJECT level /home/jenkins/.jenkins/workspace/dev-language/respect-server/build/swagger-ui-respect to Swagger-UI
[htmlpublisher] Copying recursive using current thread
[Slack Notifications] found #225 as previous completed, non-aborted build
[Slack Notifications] will send OnEveryFailureNotification because build matches and user preferences allow it
Finished: FAILURE